BDBM50114960 2-(3,5-Bis-trifluoromethyl-phenyl)-N-[4-(1-oxa-8-aza-spiro[4.5]dec-8-yl)-1-phenyl-cyclohexyl]-propionamide::CHEMBL3085129
SMILES CC(C(=O)N[C@]1(CCC(CC1)N1CCC2(CCCO2)CC1)c1ccccc1)c1cc(cc(c1)C(F)(F)F)C(F)(F)F
InChI Key InChIKey=WCUJHRSBAKWJAP-UHFFFAOYSA-N
Data  1 KI  1 IC50
  Tab Delimited (TSV)   2D SDfile   Computed 3D by Vconf -m prep SDfile
Find this compound or compounds like it in BindingDB:
Activity Spreadsheet -- Enzyme Inhibition Constant Data from BindingDB
Found 1 hit for monomerid = 50114960
TargetPotassium voltage-gated channel subfamily H member 2(Homo sapiens (Human))
Merck Sharp & Dohme Research Laboratories
Curated by ChEMBL
LigandPNGBDBM50114960(2-(3,5-Bis-trifluoromethyl-phenyl)-N-[4-(1-oxa-8-a...)
Affinity DataKi:  730nM. Assay description: Compound was evaluated for the displacement of labelled MK-499 from the cloned channel expressed in HEK cells (Ikrchannel)
In DepthDetails ArticlePubMed